{"text_format":"1","workbook":"xlsx","n_sheets":9,"sheets":["Instruction","APOD","Mortgage","CashFlows","Sales","Proforma","Returns","Variables","Leases"],"not_rendered":{"charts":3,"images":0,"macros":0,"external_links":0,"defined_names":135,"comments":7,"pivot_tables":0},"unopened":[],"bounds":{"document_bytes":16777216,"sheet_cells":100000,"rows_first":2000,"rows_last":500,"rows_between":2000,"halvings":0,"cell_chars":16384,"cell_head_chars":4096},"cells_cut":0,"cells_raw":0,"read":"whole","date_system":"1900"}

{"sheet":"Instruction","index":0,"n_rows":0,"n_cols":0,"rows_kept":0,"cut":false,"hidden":false,"merged":[]}

{"sheet":"APOD","index":1,"n_rows":69,"n_cols":20,"rows_kept":69,"cut":false,"hidden":false,"merged":[[13,13,13,17],[14,13,14,17],[9,9,9,12],[13,19,13,21],[14,19,14,21],[10,13,10,17],[10,18,10,21],[12,19,12,21],[12,9,12,12],[11,13,11,17],[5,19,5,21],[5,9,5,12],[6,3,6,7],[10,3,10,7],[7,19,7,21],[9,19,9,21],[6,19,6,21],[41,13,41,21],[42,13,42,21],[46,13,46,21],[39,13,39,21],[16,2,16,3],[2,13,2,17],[3,13,3,17],[2,19,2,21],[3,19,3,21],[4,13,4,17],[1,3,1,7],[4,3,4,7],[5,3,5,4],[5,5,5,7],[2,3,2,7],[34,13,34,21],[1,18,1,21],[4,19,4,21],[7,13,7,17],[6,13,6,17],[18,13,18,21],[19,13,19,21],[23,13,23,21],[24,13,24,21],[20,13,20,21],[21,13,21,21],[22,13,22,21],[29,13,29,21],[40,13,40,21],[35,13,35,21],[36,13,36,21],[37,13,37,21],[38,13,38,21],[31,13,31,21],[32,13,32,21],[30,13,30,21],[33,13,33,21],[25,13,25,21],[26,13,26,21],[28,2,28,3],[25,2,25,3],[26,2,26,3],[27,2,27,3],[27,13,27,21],[28,13,28,21],[30,2,30,3],[31,2,31,3],[37,2,37,3],[32,2,32,3],[33,2,33,3],[34,2,34,3],[36,2,36,3],[43,2,43,3],[47,13,47,21],[50,13,50,21],[45,13,45,21],[43,13,43,21],[44,13,44,21],[55,2,55,3],[60,1,60,19],[50,2,50,3],[51,2,51,3],[55,13,55,21],[56,13,56,21],[51,13,51,21],[52,13,52,21],[53,13,53,21],[54,13,54,21],[52,2,52,3],[53,2,53,3],[45,2,45,3],[3,3,3,7],[38,2,38,3],[46,2,46,3],[47,2,47,3],[44,2,44,3],[39,2,39,3],[29,2,29,3],[1,9,1,11],[1,13,1,17],[9,13,9,17],[4,9,4,12],[2,9,2,12],[3,9,3,12],[5,13,5,17],[6,9,6,12],[7,9,7,12],[61,7,61,15],[11,9,11,12],[11,19,11,21],[12,13,12,17],[59,3,59,21],[54,2,54,3],[56,2,56,3],[40,2,40,3],[41,2,41,3],[42,2,42,3]]}
[null,null," ",null,null,"Annual Property Operating Data"]
[null,null,"Property Name","Scenario 2",null,null,null,null,null,{"$f":"TODAY()","v":"2004-10-21"},null,null,null,"Property Acquisition Cost",null,null,null,null,"Percent"]
[null,null,"Description ","Investment Property",null,null,null,null,null,"            Purchase Price                          ",null,null,null,275000,null,null,null,null," ",{"$f":"SUM(purchase_price/N6)","v":1}]
[null,null,"Location",null,null,null,null,null,null,"            Acquisition & Closing Costs                      ",null,null,null,0,null,null,null,null," ",{"$f":"SUM(Fnc_Acquisition_Costs/N6)","v":0}]
[null,null,"Property Type",null,null,null,null,null,null,"            Loan Points",null,null,null,{"$f":"IF(CashFlows!I5,CashFlows!I5,)","v":0},null,null,null,null,null,{"$f":"SUM(Loan_Points/N6)","v":0}]
[null,null,"Property Size",1974,null,"Square Feet",null,null,null,"            Adjusted Basis(C.R. Taxes) ",null,null,null,{"$f":"SUM(N3:R5)","v":275000},null,null,null,null,null,{"$f":"SUM(N6/N6)","v":1}]
[null,null,null,"Mortgage Information",null,null,null,null,null,"            Mortgages                                    ",null,null,null,{"$f":"Fnc_Amount_Mtg_1+Fnc_Amount_Mtg_2","v":220000},null,null,null,null,null,{"$f":"SUM(Total_Beginning_Mortgages/N6)","v":0.8}]
[null,null,null,"Balance",null," Payment",null,"Interest",null,"            Investment Amount                 ",null,null,null,{"$f":"+purchase_price+Fnc_Acquisition_Costs+Loan_Points-Total_Beginning_Mortgages","v":55000},null,null,null,null,null,{"$f":"SUM(N8)/N6","v":0.2}]
[null,null,"First Mortgage",{"$f":"Fnc_Amount_Mtg_1","v":220000},null,{"$f":"Per_Pmt_Mtg_1","v":1783.0239358865356},null,{"$f":"Rate_Mtg_1","v":5.3749999999999999E-2}]
[null,null,"Second Mortgage",{"$f":"Fnc_Amount_Mtg_2","v":0},null,{"$f":"Per_Pmt_Mtg_2","v":0},null,{"$f":"Rate_Mtg_2","v":0},null,"           Adjusted Basis (C.R. Property) ",null,null,null,{"$f":"+purchase_price + Fnc_Acquisition_Costs","v":275000},null,null,null,null,null,{"$f":"IF(fnc_improvements_value>0,SUM(fnc_improvements_value/N15),\" \")","v":1}]
{"$rows_left_out":60}
{"sheet":"Mortgage","index":2,"n_rows":33,"n_cols":12,"rows_kept":33,"cut":false,"hidden":false,"merged":[[2,1,2,5],[2,8,2,12],[14,4,14,8],[16,6,16,7],[16,4,16,5],[4,3,4,5],[32,0,32,12],[5,1,5,2],[6,1,6,2],[20,8,20,12],[17,4,17,5],[17,6,17,7],[18,4,18,5],[18,6,18,7]]}
[" ",null,null,null,null,"Mortgage Information"]
[]
[null,"              Acquisition Information",null,null,null,null,null,null,"              Mortgage Information"]
[null,null,null,null,null,null,null,null,null,"      First",null,"    Second"]
[null,null,null,"Acquisition Items",null,null,null,null,null,"Mortgage",null,"Mortgage"]
[null," Purchase Price",null,{"$f":"IF(+purchase_price,purchase_price,)","v":275000},null,{"$f":"SUM(D6/D6)","v":1},null,null,"Amount",220000,null,0]
[null," Acquisition & Closing Costs",null,{"$f":"IF(Fnc_Acquisition_Costs,Fnc_Acquisition_Costs,)","v":0},null,{"$f":"SUM(D7/D6)","v":0},null,null,"Interest Rate",5.3749999999999999E-2,null,0]
[null," Loan Points",null,{"$f":"+Points_Mtg_1+Points_Mtg_2","v":0},null,{"$f":"SUM(D8/D6)","v":0},null,null,"Amortization Period",15,null,0]
[null," Mortgages",null,{"$f":"+Fnc_Amount_Mtg_1+Fnc_Amount_Mtg_2","v":220000},null,{"$f":"SUM(D9/D6)","v":0.8},null,null,"Loan Term",{"$f":"IF(Fnc_Amort_Period_Mtg_1,Fnc_Amort_Period_Mtg_1,)","v":15},null,{"$f":"IF(Fnc_Amort_Period_Mtg_2,Fnc_Amort_Period_Mtg_2,)","v":0}]
[null," Initial Investment",null,{"$f":"+D6+D7+D8-D9","v":55000},null,{"$f":"SUM(D10/D6)","v":0.2},null,null,"Yearly Payments",12,null,12]
{"$rows_left_out":24}
{"sheet":"CashFlows","index":3,"n_rows":75,"n_cols":14,"rows_kept":75,"cut":false,"hidden":false,"merged":[[19,1,19,2],[20,1,20,2],[21,1,21,2],[22,1,22,2],[23,1,23,2],[44,1,44,2],[26,1,26,2],[31,1,31,2],[28,1,28,2],[29,1,29,2],[30,1,30,2],[27,1,27,2],[33,1,33,2],[34,1,34,2],[38,1,38,2],[45,1,45,2],[47,1,47,12],[39,1,39,2],[40,1,40,2],[41,1,41,2],[42,1,42,2],[43,1,43,2],[2,2,2,4],[3,2,3,4],[4,2,4,4],[0,1,0,2],[0,4,0,8],[32,1,32,2],[8,4,8,8],[5,2,5,4],[24,1,24,2],[25,1,25,2]]}
[" "," ",null,null,"    Cash Flow Analysis "]
[]
[null,"Property Name","scenario3",null,null,null,"Purchase Price",null,{"$f":"IF(+purchase_price,purchase_price,)","v":275000},null,{"$f":"SUM(I3/I3)","v":1}]
[null,"Description ",null,null,null,null," Ascuisition Costs",null,{"$f":"IF(Fnc_Acquisition_Costs,Fnc_Acquisition_Costs,)","v":0},null,{"$f":"SUM(I4/I3)","v":0}]
[null," ",null,null,null,null," Loan Points",null,{"$f":"+Points_Mtg_1+Points_Mtg_2","v":0},null,{"$f":"SUM(I5/I3)","v":0}]
[null,"Forecast Date",{"$f":"TODAY()","v":"2004-10-21"},null,null,null," Mortgages",null,{"$f":"+Fnc_Amount_Mtg_1+Fnc_Amount_Mtg_2","v":220000},null,{"$f":"SUM(I6/I3)","v":0.8}]
[null,null,null,null,null,null," Initial Investment",null,{"$f":"+I3+I4+I5-I6","v":55000},null,{"$f":"SUM(I7/I3)","v":0.2}]
[]
[null," "," ",null,"          Mortgage Information"]
[null,null,null,null,"Balance",null,"Payment",null,"Interest"]
{"$rows_left_out":66}
{"sheet":"Sales","index":4,"n_rows":56,"n_cols":11,"rows_kept":56,"cut":false,"hidden":false,"merged":[[0,2,0,6]]}
[null," ","       Forecasted Sales "]
[]
[null,null,null,null,"Mortgage Information"]
[null,"Calendar Year",{"$f":"CashFlows!E18","v":2004},null,{"$f":"CashFlows!G18","v":2005},null,{"$f":"CashFlows!I18","v":2006},null,{"$f":"CashFlows!K18","v":2007},null,{"$f":"CashFlows!M18","v":2008}]
[null,"First Mortgage Principal Balance ",{"$f":"FV(Mortgage!J7/Mortgage!J10,Variables!F59,Mortgage!J11,-Mortgage!J6)","v":210189.36386935253},null,{"$f":"FV(Mortgage!$J$7/Mortgage!$J$10,Mortgage!$J$10,Mortgage!$J$11,-C5,0)*(fnc_Loan_Term_Mtg_1>1)","v":199838.2193285439},null,{"$f":"FV(Mortgage!$J$7/Mortgage!$J$10,Mortgage!$J$10,Mortgage!$J$11,-E5,0)*(fnc_Loan_Term_Mtg_1>2)","v":188916.78753983468},null,{"$f":"FV(Mortgage!$J$7/Mortgage!$J$10,Mortgage!$J$10,Mortgage!$J$11,-G5,0)*(fnc_Loan_Term_Mtg_1>3)","v":177393.6490264863},null,{"$f":"FV(Mortgage!$J$7/Mortgage!$J$10,Mortgage!$J$10,Mortgage!$J$11,-I5,0)*(fnc_Loan_Term_Mtg_1>4)","v":165235.65328319132}]
[null,"Second Mortgage Principal Balance",{"$f":"FV(Mortgage!L7/Mortgage!L10,Variables!H59,Mortgage!L11,-Mortgage!L6)","v":0},null,{"$f":"FV(Mortgage!$L$7/Mortgage!$L$10,Mortgage!$L$10,Mortgage!$L$11,-C6,0)*(fnc_Loan_Term_Mtg_2>1)","v":0},null,{"$f":"FV(Mortgage!$L$7/Mortgage!$L$10,Mortgage!$L$10,Mortgage!$L$11,-E6,0)*(fnc_Loan_Term_Mtg_2>2)","v":0},null,{"$f":"FV(Mortgage!$L$7/Mortgage!$L$10,Mortgage!$L$10,Mortgage!$L$11,-G6,0)*(fnc_Loan_Term_Mtg_2>3)","v":0},null,{"$f":"FV(Mortgage!$L$7/Mortgage!$L$10,Mortgage!$L$10,Mortgage!$L$11,-I6,0)*(fnc_Loan_Term_Mtg_2>4)","v":0}]
[null,"Total Mortgage Balances Due ",{"$f":"+C5+C6","v":210189.36386935253},null,{"$f":"+E5+E6","v":199838.2193285439},null,{"$f":"+G5+G6","v":188916.78753983468},null,{"$f":"+I5+I6","v":177393.6490264863},null,{"$f":"+K5+K6","v":165235.65328319132}]
[null,"Total Mortgage Payments  ",{"$f":"SUM(Per_Pmt_Mtg_1+Per_Pmt_Mtg_2)*12","v":21396.287230638427},null,{"$f":"SUM(Per_Pmt_Mtg_1+Per_Pmt_Mtg_2)*12","v":21396.287230638427},null,{"$f":"SUM(Per_Pmt_Mtg_1+Per_Pmt_Mtg_2)*12","v":21396.287230638427},null,{"$f":"SUM(Per_Pmt_Mtg_1+Per_Pmt_Mtg_2)*12","v":21396.287230638427},null,{"$f":"SUM(Per_Pmt_Mtg_1+Per_Pmt_Mtg_2)*12","v":21396.287230638427}]
[null,"Net Operating income  on Sales",{"$f":"+Fnc_NOI_Yr_1","v":12102.599999999999},null,{"$f":"+Fnc_NOI_Yr_2","v":12843.918},null,{"$f":"+Fnc_NOI_Yr_3","v":13629.224677500002},null,{"$f":"+Fnc_NOI_Yr_4","v":14461.076097731249},null,{"$f":"+Fnc_NOI_Yr_5","v":15342.174718751387}]
[]
{"$rows_left_out":47}
{"sheet":"Proforma","index":5,"n_rows":29,"n_cols":14,"rows_kept":29,"cut":false,"hidden":false,"merged":[[23,7,23,8],[0,4,0,10],[1,4,1,10],[20,7,20,8],[21,7,21,8],[19,7,19,8],[28,4,28,10],[13,6,13,9],[24,7,24,8],[25,7,25,8],[22,7,22,8]]}
[null,null,null,null,"Proforma Summary  "]
[null,null,null,null,{"$f":"\"Proforma Calendar Year - \"&TEXT(CashFlows!E18,\"####\")","v":"Proforma Calendar Year - 2004"}]
[]
[null,null,null,null,"Annual",null,"Monthly",null,null,null,null,"Annual",null,"Monthly"]
[null,null,null,null,"Balance",null,"Figure",null,null,null,null,"Balance",null,"Figure"]
[null,"Gross Operatiing Income",null,null,{"$f":"SUM(GOI_APOD)","v":18156.599999999999},null,{"$f":"SUM(E6/12)","v":1513.05},null,null,"First Mortgage",null,{"$f":"SUM(Fnc_Amount_Mtg_1)","v":220000},null,{"$f":"SUM(Per_Pmt_Mtg_1)","v":1783.0239358865356}]
[null,"Total Operating Expenses",null,null,{"$f":"SUM(OP_EXP_APOD)","v":6054},null,{"$f":"SUM(E7/12)","v":504.5},null,null,"Second Mortgage",null,{"$f":"SUM(Fnc_Amount_Mtg_2)","v":0},null,{"$f":"SUM(Per_Pmt_Mtg_2)","v":0}]
[null,"Net Operating Income",null,null,{"$f":"SUM(E6-E7)","v":12102.599999999999},null,{"$f":"SUM(E8/12)","v":1008.5499999999998},null,null,"Total Mortgage",null,{"$f":"SUM(L6:L7)","v":220000},null,{"$f":"SUM(N6:N7)","v":1783.0239358865356}]
[]
[null,"Cap Rate for Estimated Sale",null,null,0.06,null,null,null,null,"Purchase Price                          ",null,{"$f":"SUM(purchase_price)","v":275000}]
{"$rows_left_out":20}
{"sheet":"Returns","index":6,"n_rows":58,"n_cols":43,"rows_kept":58,"cut":false,"hidden":false,"merged":[[15,6,15,9],[58,1,58,15],[28,2,28,3],[28,6,28,7],[28,10,28,11],[57,1,57,15],[27,6,27,7],[27,10,27,11],[27,2,27,3],[0,5,0,9],[1,2,1,5],[14,6,14,7],[14,2,14,3],[2,6,2,9],[14,10,14,11]]}
["  "," "," ",null,null,"                      RETURNS"]
[null,null,"    INTERNAL RATE OF RETURN",null,null,null,"           RETURN ON INVESTMENT",null,null,null,"           NET PRESENT VALUE"]
[null,null,null,null,null,null,"Cash Flow Before Tax",null,null,null,null,null,null,null," "]
[null,null,"Analysis I","   Investment",null,"Return on","Analysis II","   Investment",null,"Return on","Analysis III","   Investment",null,"Return on"," "]
[null," "," ","      Amount",null,"Investment"," ","      Amount",null,"Investment"," ","      Amount",null,"Investment"," "]
[null,"Year"," ",{"$f":"-fnc_Initial_Investment","v":-55000},null," "," ",{"$f":"-fnc_Initial_Investment","v":-55000},null,null," ",{"$f":"-fnc_Initial_Investment","v":-55000},null,null," "]
[null,1," ",{"$f":"Fnc_CFBT_1","v":-9293.6872306384284},null,{"$f":"SUM((D7)/(D6*-1))","v":-0.16897613146615326}," ",{"$f":"Fnc_CFBT_1","v":-9293.6872306384284},null,{"$f":"SUM((H7)/(H6*-1))","v":-0.16897613146615326}," ",{"$f":"Fnc_CFBT_1","v":-9293.6872306384284},null,{"$f":"SUM((L7)/(L6*-1))","v":-0.16897613146615326}," "]
[null,2,"CFBT",{"$f":"Fnc_CFBT_2","v":-8552.3692306384273},null,{"$f":"SUM((D8)/(D6*-1))","v":-0.15549762237524414},"CFBT",{"$f":"Fnc_CFBT_2","v":-8552.3692306384273},null,{"$f":"SUM((H8)/(H6*-1))","v":-0.15549762237524414},"CFBT",{"$f":"Fnc_CFBT_2","v":-8552.3692306384273},null,{"$f":"SUM((L8)/(L6*-1))","v":-0.15549762237524414}," "]
[null,3,"NOI",{"$f":"Fnc_CFBT_3","v":-7767.0625531384248},null,{"$f":"SUM((D9)/(D6*-1))","v":-0.14121931914797137},"NOI",{"$f":"Fnc_CFBT_3","v":-7767.0625531384248},null,{"$f":"SUM((H9)/(H6*-1))","v":-0.14121931914797137},"NOI",{"$f":"Fnc_CFBT_3","v":-7767.0625531384248},null,{"$f":"SUM((L9)/(L6*-1))","v":-0.14121931914797137}," "]
[null,4," ",{"$f":"Fnc_CFBT_4","v":-6935.2111329071777},null,{"$f":"SUM((D10)/(D6*-1))","v":-0.12609474787103958}," ",{"$f":"Fnc_CFBT_4","v":-6935.2111329071777},null,{"$f":"SUM((H10)/(H6*-1))","v":-0.12609474787103958}," ",{"$f":"Fnc_CFBT_4","v":-6935.2111329071777},null,{"$f":"SUM((L10)/(L6*-1))","v":-0.12609474787103958}," ",null,null,null,null,null,null,null,null,null,null,null,null,null,null,null,null,null,null,null,null,null,{"$f":"-fnc_Initial_Investment","v":-55000}," ","0",{"$f":"-fnc_Initial_Investment","v":-55000},null,"0",{"$f":"-fnc_Initial_Investment","v":-55000}]
{"$rows_left_out":49}
{"sheet":"Variables","index":7,"n_rows":59,"n_cols":20,"rows_kept":59,"cut":false,"hidden":false,"merged":[[0,2,0,9],[8,1,8,2],[7,1,7,2],[55,3,55,9],[5,1,5,2],[3,3,3,4]]}
[null," ","               Variables"]
[null,null,null,"       Before Taxes",null,null,null,null,null,null,null," "]
[null,"Return on Investment",null,"ROI",null,"Rate of Return",null,null,null,null,null," "]
[null,"First year proceeds ","Year 1",{"$f":"roi_y1_cash","v":-9293.6872306384284},null,{"$f":"Fnc_roi_y1_bt","v":-0.16897613146615326},null,null,null,null,null," "]
[]
[null,"              Sales Rate & Expenses    "]
[null,null," ","Analysis I",null,"Analysis II",null,"Analysis III",null,"Analysis IIII",null,"Analysis V",null,null,null,null,null,null,null,"Analysis VI"]
[null,"Cap rate for Sales Forecast    ",null,0.1,null,{"$f":"SUM(Fnc_Cap_Rate_Used_In_Sale_1+0.005)","v":0.10500000000000001},null,0.1,null,{"$f":"SUM(Fnc_Cap_rate_used_in_sale_2+0.005)","v":0.10500000000000001},null,0.1,null,null,null,null,null,null,null,{"$f":"SUM(Fnc_cap_rate_used_in_sale_3+0.005)","v":0.10500000000000001}]
[null,"Expenses for Sales Forecast    ",null,0.06,null,{"$f":"fnc_expenses_of_sale","v":0.06},null,{"$f":"fnc_expenses_of_sale","v":0.06},null,{"$f":"fnc_expenses_of_sale","v":0.06},null,{"$f":"fnc_expenses_of_sale","v":0.06},null,null,null,null,null,null,null,{"$f":"fnc_expenses_of_sale","v":0.06}]
[]
{"$rows_left_out":50}
{"sheet":"Leases","index":8,"n_rows":27,"n_cols":24,"rows_kept":27,"cut":false,"hidden":false,"merged":[[0,5,0,13]]}
[null,null,null," ",null,"Lease Analysis"]
[null,null,null,null,null,null,null,null,null,null,null," "]
[]
[null,null,null,null,null,"Square",null,"Base",null,"Monthly",null,"Annual",null,"Income",null,"Taxes",null,"Fees",null,"Monthly"]
[null,"Rental Space",null,"Identifier",null,"Feet",null,"Rent",null,"Pass Thru",null,"Income",null,"PSF",null,"Per Unit",null,"Per Unit",null,"Net Rent"]
[null,"scenario 1",null,null,null,1974,null,1650,null,null,null,{"$f":"IF(H6>0,SUM((H6+J6)*12),\" \")","v":19800},null,{"$f":"IF(H6>0,SUM(H6/F6),\" \")","v":0.83586626139817632},null,{"$f":"IF(H6>0,SUM((fnc_rs_taxes/F24)*F6)/12,\" \")","v":172},null,{"$f":"IF(H6>0,SUM(APOD!J28:'APOD'!J30)/F24*F6/12,\" \")","v":193},null,{"$f":"IF(H6>0,SUM(H6-P6-R6),\" \")","v":1285},null,null,null,{"$f":"IF(H6>0,1,\"0\")","v":1}]
[null,null,null,null,null,null,null,null,null,null,null," ",null," ",null,{"$f":"IF(H7>0,SUM((fnc_rs_taxes/F24)*F7)/12,\" \")","v":" "},null,{"$f":"IF(H7>0,SUM(APOD!J28:'APOD'!J30)/F24*F7/12,\" \")","v":" "},null," ",null,null,null,"0"]
[null,null,null,null,null,null,null,null,null,null,null," ",null," ",null,{"$f":"IF(H8>0,SUM((fnc_rs_taxes/F24)*F8)/12,\" \")","v":" "},null,{"$f":"IF(H8>0,SUM(APOD!J28:'APOD'!J30)/F24*F8/12,\" \")","v":" "},null," ",null,null,null,"0"]
[null," ",null," ",null,0,null,0,null,0,null," ",null," ",null,{"$f":"IF(H9>0,SUM((fnc_rs_taxes/F24)*F9)/12,\" \")","v":" "},null,{"$f":"IF(H9>0,SUM(APOD!J28:'APOD'!J30)/F24*F9/12,\" \")","v":" "},null," ",null,null,null,"0"]
[null," ",null," ",null,0," ",0,null,0," "," ",null," ",null,{"$f":"IF(H10>0,SUM((fnc_rs_taxes/F24)*F10)/12,\" \")","v":" "},null,{"$f":"IF(H10>0,SUM(APOD!J28:'APOD'!J30)/F24*F10/12,\" \")","v":" "},null," ",null,null,null,"0"]
{"$rows_left_out":17}